Страниц: 1 [2]
  Печать  
Автор Тема: Проблемы с шаблоном.  (Прочитано 12765 раз)
Hagen_001
Участник
*
Offline Offline

Сообщений: 0


Просмотр профиля
« Ответ #15 : Июля 12, 2007, 01:28:36 am »

Удивительно но Momentics даже не компилит стандартные проекты(при создании проэкта не добавляю ниодной строки), уважаемые господа, никто не знает как можно решить эту проблему? Это произошло как-то само собой.... писал код... а потом началось! Это какая-то подстава!
Записан
qnxloder
Sr. Member
****
Offline Offline

Сообщений: 292


Просмотр профиля
« Ответ #16 : Июля 12, 2007, 10:11:11 am »

Лечится удалением /root/workspace/.metadata.
Записан
lastcross
Full Member
***
Offline Offline

Сообщений: 237


Просмотр профиля
« Ответ #17 : Июля 12, 2007, 11:07:18 am »

Хм..Hagen_001.. а скажите где у Вас объявлена ..и описана Ваша функция cashtest_shabl..?
Я к тому.. что шаблоны вроде незя как разделять на .H и .CPP

Ибо инстанцирование выполняеца в момент компиляции!
Попробуйте поместить все в один файл (.h-овский)..я имею ввиду тело функции.
Записан
lastcross
Full Member
***
Offline Offline

Сообщений: 237


Просмотр профиля
« Ответ #18 : Июля 12, 2007, 11:09:48 am »

(..ну понятно, я упускаю всякие export-ы .. ибо про эту поддержку компилятором нужно еще прочитать.. где-то)
Записан
Hagen_001
Участник
*
Offline Offline

Сообщений: 0


Просмотр профиля
« Ответ #19 : Июля 12, 2007, 11:48:29 am »

To qnxloder
Удалил /root/workspace/.metadata. После чего даже проєкт не создаётся... а раньше создавалса...хоть ни так обидно было..

To lastcross
qnxloder
Я же уже говорил что не в коде дело.... шаблоны у меня описаны в одном СPP файле...так что не в єтом проблема..

Кстати вот ошибки которые возникают при компиляции проэкта аля "Hello world!...."

Severity   Description   Resource   In Folder   Location   Creation Time
2   *** [E:/QNX630/workspace/test/arm/o-be/test] Error 1   test         11 Июль 2007 г. 23:14:17
2   *** [E:/QNX630/workspace/test/arm/o-be-g/test_g] Error 1   test         11 Июль 2007 г. 23:14:17
2   *** [E:/QNX630/workspace/test/arm/o-le/hjj] Error 1   test         11 Июль 2007 г. 23:14:17
2   *** [E:/QNX630/workspace/test/arm/o-le-g/test_g] Error 1   test         11 Июль 2007 г. 23:14:17
2   *** [E:/QNX630/workspace/test/mips/o-be/test] Error 1   test         11 Июль 2007 г. 23:14:17
2   *** [E:/QNX630/workspace/test/mips/o-be-g/test_g] Error 1   test         11 Июль 2007 г. 23:14:17
2   *** [E:/QNX630/workspace/test/mips/o-le/test] Error 1   test         11 Июль 2007 г. 23:14:17
2   *** [E:/QNX630/workspace/test/mips/o-le-g/test_g] Error 1   test         11 Июль 2007 г. 23:14:17
2   *** [E:/QNX630/workspace/test/ppc/o-be/test] Error 1   test         11 Июль 2007 г. 23:14:17
2   *** [E:/QNX630/workspace/test/ppc/o-be-g/test_g] Error 1   test         11 Июль 2007 г. 23:14:17
2   *** [E:/QNX630/workspace/test/sh/o-le/test] Error 1   test         11 Июль 2007 г. 23:14:17
2   *** [E:/QNX630/workspace/test/sh/o-le-g/test_g] Error 1   test         11 Июль 2007 г. 23:14:17
2   *** [E:/QNX630/workspace/test/x86/o/test] Error 1   test         11 Июль 2007 г. 23:14:17
2   *** [E:/QNX630/workspace/test/x86/o-g/test_g] Error 1   test         11 Июль 2007 г. 23:14:17
2   /cygdrive/e/QNX630/host/win32/x86/usr/bin/arm-unknown-nto-qnx6.3.0-ld cannot find -lcpp   test      line 0   11 Июль 2007 г. 23:14:17
2   /cygdrive/e/QNX630/host/win32/x86/usr/bin/i386-pc-nto-qnx6.3.0-ld cannot find -lcpp   test      line 0   11 Июль 2007 г. 23:14:17
2   /cygdrive/e/QNX630/host/win32/x86/usr/bin/mips-unknown-nto-qnx6.3.0-ld cannot find -lcpp   test      line 0   11 Июль 2007 г. 23:14:17
2   /cygdrive/e/QNX630/host/win32/x86/usr/bin/powerpc-unknown-nto-qnx6.3.0-ld cannot find -lcpp   test      line 0   11 Июль 2007 г. 23:14:17
2   /cygdrive/e/QNX630/host/win32/x86/usr/bin/sh-unknown-nto-qnx6.3.0-ld cannot find -lcpp   test      line 0   11 Июль 2007 г. 23:14:17
Записан
Страниц: 1 [2]
  Печать  
 
Перейти в: